Target
Falcipain-2
Ligand
BDBM50415537
Substrate
Meas. Tech.
ChEMBL_612226 (CHEMBL1074166)
IC50
>100000±n/a nM
Citation
 Hans, RHGuantai, EMLategan, CSmith, PJWan, BFranzblau, SGGut, JRosenthal, PJChibale, K Synthesis, antimalarial and antitubercular activity of acetylenic chalcones. Bioorg Med Chem Lett 20:942-4 (2010)  
Target
Name:
Falcipain-2
Synonyms:
Type:
Enzyme
Mol. Mass.:
55912.57
Organism:
Plasmodium falciparum
Description:
Residue:
484
  
Inhibitor
Name:
BDBM50415537
Synonyms:
CHEMBL596611
Type:
Small organic molecule
Emp. Form.:
C19H16O3
Mol. Mass.:
292.3285
SMILES:
COc1ccc(\C=C\C(=O)c2cccc(OCC#C)c2)cc1
: