Target
Oxysterols receptor LXR-beta
Ligand
BDBM50415825
Substrate
Meas. Tech.
ChEMBL_625546 (CHEMBL1109726)
IC50
4±n/a nM
Citation
 Zuercher, WJBuckholz, RGCampobasso, NCollins, JLGalardi, CMGampe, RTHyatt, SMMerrihew, SLMoore, JTOplinger, JAReid, PRSpearing, PKStanley, TBStewart, ELWillson, TM Discovery of tertiary sulfonamides as potent liver X receptor antagonists. J Med Chem 53:3412-6 (2010)  
Target
Name:
Oxysterols receptor LXR-beta
Synonyms:
LXRB Liver X, LXR beta NR1H2 Nuclear receptor NER Ubiquitously-expressed nuclear receptor
Type:
Enzyme Catalytic Domain
Mol. Mass.:
50978.79
Organism:
Homo sapiens (Human)
Description:
P55055
Residue:
460
  
Inhibitor
Name:
BDBM50415825
Synonyms:
CHEMBL1091034
Type:
Small organic molecule
Emp. Form.:
C27H23ClFNO4S2
Mol. Mass.:
544.057
SMILES:
CS(=O)(=O)c1cccc(c1)-c1ccc(CN(Cc2ccc(F)cc2Cl)S(=O)(=O)c2ccccc2)cc1
: