Target
Histamine H1 receptor
Ligand
BDBM50415917
Substrate
Meas. Tech.
ChEMBL_629747 (CHEMBL1121259)
EC50
831.76±n/a nM
Citation
 Ghorai, PKraus, ABirnkammer, TGeyer, RBernhardt, GDove, SSeifert, RElz, SBuschauer, A Chiral NG-acylated hetarylpropylguanidine-type histamine H2 receptor agonists do not show significant stereoselectivity. Bioorg Med Chem Lett 20:3173-6 (2010)  
Target
Name:
Histamine H1 receptor
Synonyms:
H1R HISTAMINE H1 HRH1_HUMAN
Type:
G Protein-Coupled Receptor (GPCR)
Mol. Mass.:
55808.72
Organism:
Homo sapiens (Human)
Description:
Cell pellets from SK-N-MC cells transfected with human H1 receptor were used in binding assay.
Residue:
487
  
Inhibitor
Name:
BDBM50415917
Synonyms:
CHEMBL1096429
Type:
Small organic molecule
Emp. Form.:
C17H23N5O
Mol. Mass.:
313.3974
SMILES:
C[C@@H](CC(=O)NC(N)=NCCCc1cnc[nH]1)c1ccccc1
: