Target
Muscarinic acetylcholine receptor M5
Ligand
BDBM50416141
Substrate
Meas. Tech.
ChEMBL_635230 (CHEMBL1117841)
IC50
501.19±n/a nM
Citation
 Budzik, BGarzya, VShi, DWalker, GLauchart, YLucas, AJRivero, RALangmead, CJWatson, JWu, ZForbes, ITJin, J 2' biaryl amides as novel and subtype selective M1 agonists. Part II: Further optimization and profiling. Bioorg Med Chem Lett 20:3545-9 (2010)  
Target
Name:
Muscarinic acetylcholine receptor M5
Synonyms:
ACM5_HUMAN | CHRM5
Type:
PROTEIN
Mol. Mass.:
60102.35
Organism:
Homo sapiens (Human)
Description:
ChEMBL_1517990
Residue:
532
  
Inhibitor
Name:
BDBM50416141
Synonyms:
CHEMBL1083925
Type:
Small organic molecule
Emp. Form.:
C20H22ClFN2O
Mol. Mass.:
360.853
SMILES:
C[C@H]1CNCC[C@@H]1CNC(=O)c1c(F)cccc1-c1cccc(Cl)c1
: