Target
C-C chemokine receptor type 2
Ligand
BDBM50416285
Substrate
Meas. Tech.
ChEMBL_640105 (CHEMBL1174375)
Ki
1.26±n/a nM
Citation
 Peace, SPhilp, JBrooks, CPiercy, VMoores, KSmethurst, CWatson, SGaines, SZippoli, MMookherjee, CIfe, R Identification of a sulfonamide series of CCR2 antagonists. Bioorg Med Chem Lett 20:3961-4 (2010)  
Target
Name:
C-C chemokine receptor type 2
Synonyms:
C-C chemokine receptor type 2 (CCR2) CCR2_HUMAN Chemoattractant Cytokine Receptor 2 (CCR2) Monocyte chemotactic protein-1 (MCP-1)
Type:
Enzyme
Mol. Mass.:
41932.32
Organism:
Homo sapiens (Human)
Description:
P41597
Residue:
374
  
Inhibitor
Name:
BDBM50416285
Synonyms:
CHEMBL1171008
Type:
Small organic molecule
Emp. Form.:
C18H11Cl3N2O5S
Mol. Mass.:
473.714
SMILES:
OC(=O)c1ccccc1Oc1ncc(Cl)cc1NS(=O)(=O)c1ccc(Cl)c(Cl)c1
: