Target
Urotensin-2
Ligand
BDBM50416347
Substrate
Meas. Tech.
ChEMBL_643307 (CHEMBL1177478)
EC50
147.91±n/a nM
Citation
 Lehmann, FCurrier, EAOlsson, RMa, JNBurstein, ESHacksell, ULuthman, K Optimization of isochromanone based urotensin II receptor agonists. Bioorg Med Chem 18:4844-54 (2011)  
Target
Name:
Urotensin-2
Synonyms:
UTS2 | UTS2_HUMAN
Type:
PROTEIN
Mol. Mass.:
14297.49
Organism:
Homo sapiens (Human)
Description:
ChEMBL_643307
Residue:
124
  
Inhibitor
Name:
BDBM50416347
Synonyms:
CHEMBL1173399
Type:
Small organic molecule
Emp. Form.:
C25H27NO2
Mol. Mass.:
373.4874
SMILES:
CN(C)CCC1(Cc2cc(C)c(C)cc2C(=O)O1)c1ccc2ccccc2c1
: