Target
Neuronal acetylcholine receptor subunit alpha-7
Ligand
BDBM50416404
Substrate
Meas. Tech.
ChEMBL_643567 (CHEMBL1212431)
EC50
7.94±n/a nM
Citation
 Capelli, AMCastelletti, LSalvagno, COliosi, BDi Lenarda, EVirginio, CLightfoot, AKew, JNTeague, S Identification of novel alpha7 nAChR positive allosteric modulators with the use of pharmacophore in silico screening methods. Bioorg Med Chem Lett 20:4561-5 (2010)  
Target
Name:
Neuronal acetylcholine receptor subunit alpha-7
Synonyms:
ACHA7_HUMAN Cholinergic, Nicotinic Alpha7 Neuronal acetylcholine receptor protein alpha-7 subunit Nicotinic acetylcholine receptor alpha-7 (alpha7 nAChR)
Type:
Mol. Mass.:
56448.33
Organism:
Homo sapiens (Human)
Description:
CHRNA7 (NACHRA7)
Residue:
502
  
Inhibitor
Name:
BDBM50416404
Synonyms:
CHEMBL1210577
Type:
Small organic molecule
Emp. Form.:
C25H27N3O2
Mol. Mass.:
401.5008
SMILES:
O=C(Cn1nc(C2CCCCC2)c2ccccc2c1=O)NC1Cc2ccccc2C1
: