Target
ATP synthase subunit c
Ligand
BDBM50333125
Substrate
Meas. Tech.
ChEMBL_653029 (CHEMBL1226232)
IC50
2.5±n/a nM
Citation
 Koul, ADendouga, NVergauwen, KMolenberghs, BVranckx, LWillebrords, RRistic, ZLill, HDorange, IGuillemont, JBald, DAndries, K Diarylquinolines target subunit c of mycobacterial ATP synthase. Nat Chem Biol 3:323-4 (2007)  
Target
Name:
ATP synthase subunit c
Synonyms:
Putative uncharacterized protein atpE | Subunit c of ATP synthase
Type:
PROTEIN
Mol. Mass.:
8592.94
Organism:
Mycobacterium smegmatis
Description:
ChEMBL_653029
Residue:
86
  
Inhibitor
Name:
BDBM50333125
Synonyms:
(1R,2S)-1-(6-bromoquinolin-3-yl)-4-(dimethylamino)-2-(naphthalen-1-yl)-1-phenylbutan-2-ol | CHEMBL1631683
Type:
Small organic molecule
Emp. Form.:
C31H29BrN2O
Mol. Mass.:
525.479
SMILES:
CN(C)CC[C@](O)([C@H](c1ccccc1)c1cnc2ccc(Br)cc2c1)c1cccc2ccccc12
: