Target
Melatonin receptor type 1B
Ligand
BDBM50416707
Substrate
Meas. Tech.
ChEMBL_652046 (CHEMBL1227856)
Ki
48.98±n/a nM
Citation
 Carocci, ACatalano, ALovece, ALentini, GDuranti, ALucini, VPannacci, MScaglione, FFranchini, C Design, synthesis, and pharmacological effects of structurally simple ligands for MT(1) and MT(2) melatonin receptors. Bioorg Med Chem 18:6496-511 (2010)  
Target
Name:
Melatonin receptor type 1B
Synonyms:
MTNR1B Mel-1B-R Melatonin 1B Melatonin receptor type 1B | Melatonin receptor type 2 (MT2)
Type:
Enzyme
Mol. Mass.:
40203.54
Organism:
Homo sapiens (Human)
Description:
P49286
Residue:
362
  
Inhibitor
Name:
BDBM50416707
Synonyms:
CHEMBL1223191
Type:
Small organic molecule
Emp. Form.:
C14H19NO2S
Mol. Mass.:
265.371
SMILES:
COc1cccc(S[C@H](C)CNC(=O)C2CC2)c1
: