Target
Mast/stem cell growth factor receptor Kit
Ligand
BDBM8835
Substrate
Meas. Tech.
ChEMBL_654560 (CHEMBL1243604)
IC50
26.92±n/a nM
Citation
 Cao, HZhang, HZheng, XGao, D 3D QSAR studies on a series of potent and high selective inhibitors for three kinases of RTK family. J Mol Graph Model 26:236-45 (2007)  
Target
Name:
Mast/stem cell growth factor receptor Kit
Synonyms:
CD117 antigen KIT Mast/stem cell growth factor receptor Kit (cKIT) Proto-oncogene tyrosine-protein kinase Kit Stem cell growth factor receptor Tyrosine-protein kinase Kit c-kit v-kit Hardy-Zuckerman 4 feline sarcoma viral oncogene homolog
Type:
Protein
Mol. Mass.:
109869.37
Organism:
Homo sapiens (Human)
Description:
P10721
Residue:
976
  
Inhibitor
Name:
BDBM8835
Synonyms:
3-(4-{4-amino-6-methylthieno[2,3-d]pyrimidin-5-yl}phenyl)-1-(3-fluorophenyl)urea N-[4-(4-Amino-6-methylthieno[2,3-d]pyrimidin-5-yl)-phenyl]-N -(3-fluorophenyl)urea | Thienopyrimidine deriv. 17
Type:
Small organic molecule
Emp. Form.:
C20H16FN5OS
Mol. Mass.:
393.437
SMILES:
Cc1sc2ncnc(N)c2c1-c1ccc(NC(=O)Nc2cccc(F)c2)cc1
: