Target
Vascular endothelial growth factor receptor 2
Ligand
BDBM50375679
Substrate
Meas. Tech.
ChEMBL_655558 (CHEMBL1244602)
IC50
0.501±n/a nM
Citation
 Du, JLei, BQin, JLiu, HYao, X Molecular modeling studies of vascular endothelial growth factor receptor tyrosine kinase inhibitors using QSAR and docking. J Mol Graph Model 27:642-54 (2008)  
Target
Name:
Vascular endothelial growth factor receptor 2
Synonyms:
CD_antigen=CD309 Fetal liver kinase 1 (FLK-1) KDR Protein-tyrosine kinase receptor Flk-1 VEGFR-2 VEGFR2 Vascular Endothelial Growth Factor Receptor Kinase 2 Vascular endothelial growth factor receptor 2 (KDR) Vascular endothelial growth factor receptor 2 (VEGFR2) Vascular endothelial growth factor receptor-2 (VEGFR-2)
Type:
Receptor Tyrosine Kinase
Mol. Mass.:
151510.97
Organism:
Homo sapiens (Human)
Description:
P35968
Residue:
1356
  
Inhibitor
Name:
BDBM50375679
Synonyms:
CHEMBL270548
Type:
Small organic molecule
Emp. Form.:
C26H22ClN3O5
Mol. Mass.:
491.923
SMILES:
COc1cc2nccc(Oc3ccc4N(CCOc4c3)C(=O)Nc3ccc(Cl)cc3)c2cc1OC
: