Target
Vascular endothelial growth factor receptor 2
Ligand
BDBM50375684
Substrate
Meas. Tech.
ChEMBL_655558 (CHEMBL1244602)
IC50
61.66±n/a nM
Citation
 Du, JLei, BQin, JLiu, HYao, X Molecular modeling studies of vascular endothelial growth factor receptor tyrosine kinase inhibitors using QSAR and docking. J Mol Graph Model 27:642-54 (2008)  
Target
Name:
Vascular endothelial growth factor receptor 2
Synonyms:
CD_antigen=CD309 Fetal liver kinase 1 (FLK-1) KDR Protein-tyrosine kinase receptor Flk-1 VEGFR-2 VEGFR2 Vascular Endothelial Growth Factor Receptor Kinase 2 Vascular endothelial growth factor receptor 2 (KDR) Vascular endothelial growth factor receptor 2 (VEGFR2) Vascular endothelial growth factor receptor-2 (VEGFR-2)
Type:
Receptor Tyrosine Kinase
Mol. Mass.:
151510.97
Organism:
Homo sapiens (Human)
Description:
P35968
Residue:
1356
  
Inhibitor
Name:
BDBM50375684
Synonyms:
CHEMBL272688
Type:
Small organic molecule
Emp. Form.:
C23H22N4O4
Mol. Mass.:
418.4452
SMILES:
CNC(=O)c1cc(Oc2ccc3N(CCOc3c2)C(=O)Nc2ccc(C)cc2)ccn1
: