Target
Melanin-concentrating hormone receptor 1
Ligand
BDBM50215655
Substrate
Meas. Tech.
ChEMBL_662951 (CHEMBL1250810)
Ki
1.6±n/a nM
Citation
 Morales-Bayuelo, AAyazo, HVivas-Reyes, R Three-dimensional quantitative structure-activity relationship CoMSIA/CoMFA and LeapFrog studies on novel series of bicyclo [4.1.0] heptanes derivatives as melanin-concentrating hormone receptor R1 antagonists. Eur J Med Chem 45:4509-22 (2010)  
Target
Name:
Melanin-concentrating hormone receptor 1
Synonyms:
G-protein coupled receptor 24 MCH receptor 1 MCH-R1 MCHR-1 MCHR1_HUMAN Melanin-Concentrating Hormone Receptor 1 (MCH1R) Melanin-concentrating hormone receptor 1 (MCH-1) Melanin-concentrating hormone receptor 1 (MCHR-1) SLC-1 Somatostatin receptor-like protein
Type:
G Protein-Coupled Receptor (GPCR)
Mol. Mass.:
45976.27
Organism:
Homo sapiens (Human)
Description:
Membranes from CHO-K1 cells stably expressing human MCH1R were used in assays.
Residue:
422
  
Inhibitor
Name:
BDBM50215655
Synonyms:
1-((3R,6S)-6-(3-cyanophenyl)bicyclo[4.1.0]heptan-3-yl)-3-(2,6-dichloropyridin-4-yl)-1-(2-((2-hydroxyethyl)(isopropyl)amino)ethyl)urea | CHEMBL229113
Type:
Small organic molecule
Emp. Form.:
C27H33Cl2N5O2
Mol. Mass.:
530.489
SMILES:
CC(C)N(CCO)CCN([C@@H]1CC[C@@]2(CC2C1)c1cccc(c1)C#N)C(=O)Nc1cc(Cl)nc(Cl)c1
: