Target
Neuropeptide Y receptor type 5
Ligand
BDBM50417041
Substrate
Meas. Tech.
ChEMBL_664979 (CHEMBL1259936)
Ki
0.126±n/a nM
Citation
 Leslie, CPBentley, JBiagetti, MContini, SDi Fabio, RDonati, DGenski, TGuery, SMazzali, AMerlo, GPizzi, DASacco, FSeri, CTessari, MZonzini, LCaberlotto, L Discovery and structure-activity relationship of a novel spirocarbamate series of NPY Y5 antagonists. Bioorg Med Chem Lett 20:6103-7 (2010)  
Target
Name:
Neuropeptide Y receptor type 5
Synonyms:
NPY-Y5 NPY5-R NPY5R_HUMAN NPYY5 Neuropeptide Y receptor type 5 ( NPY Y5) | Y5 receptor
Type:
Enzyme
Mol. Mass.:
50746.64
Organism:
Homo sapiens (Human)
Description:
Q15761
Residue:
445
  
Inhibitor
Name:
BDBM50417041
Synonyms:
CHEMBL1257637
Type:
Small organic molecule
Emp. Form.:
C22H23N5O2S
Mol. Mass.:
421.515
SMILES:
O=C1O[C@@]2(CN1c1ccccn1)CC[C@H](CNc1ccc(cn1)-c1nccs1)CC2
: