Target
Neuropeptide Y receptor type 5
Ligand
BDBM50417044
Substrate
Meas. Tech.
ChEMBL_664979 (CHEMBL1259936)
Ki
0.1±n/a nM
Citation
 Leslie, CPBentley, JBiagetti, MContini, SDi Fabio, RDonati, DGenski, TGuery, SMazzali, AMerlo, GPizzi, DASacco, FSeri, CTessari, MZonzini, LCaberlotto, L Discovery and structure-activity relationship of a novel spirocarbamate series of NPY Y5 antagonists. Bioorg Med Chem Lett 20:6103-7 (2010)  
Target
Name:
Neuropeptide Y receptor type 5
Synonyms:
NPY-Y5 NPY5-R NPY5R_HUMAN NPYY5 Neuropeptide Y receptor type 5 ( NPY Y5) | Y5 receptor
Type:
Enzyme
Mol. Mass.:
50746.64
Organism:
Homo sapiens (Human)
Description:
Q15761
Residue:
445
  
Inhibitor
Name:
BDBM50417044
Synonyms:
CHEMBL1258340
Type:
Small organic molecule
Emp. Form.:
C23H23F2N5O2
Mol. Mass.:
439.4578
SMILES:
Fc1ccccc1-n1cc(NC[C@H]2CC[C@@]3(CN(C(=O)O3)c3cccnc3F)CC2)cn1
: