Target
Metabotropic glutamate receptor 1
Ligand
BDBM50417072
Substrate
Meas. Tech.
ChEMBL_665174 (CHEMBL1260593)
EC50
125.89±n/a nM
Citation
 Jamieson, CCampbell, RACumming, IAGillen, KJGillespie, JKazemier, BKiczun, MLamont, YLyons, AJMaclean, JKMartin, FMoir, EMMorrow, JAPantling, JRankovic, ZSmith, L A novel series of positive modulators of the AMPA receptor: structure-based lead optimization. Bioorg Med Chem Lett 20:6072-5 (2010)  
Target
Name:
Metabotropic glutamate receptor 1
Synonyms:
GPRC1A GRM1_HUMAN Metabotropic Glutamate 1a | metabotropic glutamate 1
Type:
Enzyme
Mol. Mass.:
132358.19
Organism:
Homo sapiens (Human)
Description:
Q13255
Residue:
1194
  
Inhibitor
Name:
BDBM50417072
Synonyms:
CHEMBL1258681
Type:
Small organic molecule
Emp. Form.:
C17H20F3N5O2S
Mol. Mass.:
415.433
SMILES:
CNCc1cn(CC(=O)Nc2sc3CCCCc3c2C(N)=O)nc1C(F)(F)F
: