Target
Alpha-2C adrenergic receptor
Ligand
BDBM50417349
Substrate
Meas. Tech.
ChEMBL_684822 (CHEMBL1286052)
EC50
6.3±n/a nM
Citation
 Del Bello, FMattioli, LGhelfi, FGiannella, MPiergentili, AQuaglia, WCardinaletti, CPerfumi, MThomas, RJZanelli, UMarchioro, CDal Cin, MPigini, M Fruitful adrenergica(2C)-agonism/a(2A)-antagonism combination to prevent and contrast morphine tolerance and dependence. J Med Chem 53:7825-35 (2010)  
Target
Name:
Alpha-2C adrenergic receptor
Synonyms:
ADA2C_HUMAN ADRA2L2 Adrenergic alpha2C Adrenergic receptor alpha Alpha-2 adrenergic receptor subtype C4 Alpha-2C adrenoreceptor | adrenergic, alpha-2C-, receptor [Homo sapiens]
Type:
Enzyme
Mol. Mass.:
49552.32
Organism:
Homo sapiens (Human)
Description:
P18825
Residue:
462
  
Inhibitor
Name:
BDBM50417349
Synonyms:
CHEMBL1276248
Type:
Small organic molecule
Emp. Form.:
C15H16N2OS
Mol. Mass.:
272.365
SMILES:
C[C@H](Oc1ccccc1-c1ccsc1)C1=NCCN1
: