Target
Muscarinic acetylcholine receptor M3
Ligand
BDBM50417445
Substrate
Meas. Tech.
ChEMBL_687865 (CHEMBL1291429)
IC50
0.251±n/a nM
Citation
 Stocks, MJAlcaraz, LBailey, ABowers, KDonald, DEdwards, HHunt, FKindon, NPairaudeau, GTheaker, JWarner, DJ The discovery of new spirocyclic muscarinic M3 antagonists. Bioorg Med Chem Lett 20:7458-61 (2010)  
Target
Name:
Muscarinic acetylcholine receptor M3
Synonyms:
ACM3_HUMAN Cholinergic, muscarinic M3 Muscarinic receptor M3 | RecName: Full=Muscarinic acetylcholine receptor M3
Type:
Enzyme
Mol. Mass.:
66151.03
Organism:
Homo sapiens (Human)
Description:
P20309
Residue:
590
  
Inhibitor
Name:
BDBM50417445
Synonyms:
AHR-504 GLYCOPYRROLATE
Type:
Small organic molecule
Emp. Form.:
C19H28NO3
Mol. Mass.:
318.43
SMILES:
C[N+]1(C)CCC(C1)OC(=O)C(O)(C1CCCC1)c1ccccc1
: