Target
Vitamin D3 receptor
Ligand
BDBM50417515
Substrate
Meas. Tech.
ChEMBL_695918 (CHEMBL1641105)
Ki
0.09±n/a nM
Citation
 Grzywacz, PChiellini, GPlum, LAClagett-Dame, MDeLuca, HF Removal of the 26-methyl group from 19-nor-1a,25-dihydroxyvitamin D3 markedly reduces in vivo calcemic activity without altering in vitro VDR binding, HL-60 cell differentiation, and transcription. J Med Chem 53:8642-9 (2010)  
Target
Name:
Vitamin D3 receptor
Synonyms:
Nr1i1 Vdr | Vitamin D receptor
Type:
PROTEIN
Mol. Mass.:
47811.07
Organism:
Rattus norvegicus
Description:
ChEMBL_1505946
Residue:
423
  
Inhibitor
Name:
BDBM50417515
Synonyms:
CHEMBL1630755
Type:
Small organic molecule
Emp. Form.:
C26H42O3
Mol. Mass.:
402.6099
SMILES:
[#6]-[#6@@H](-[#8])-[#6]-[#6]-[#6]-[#6@H](-[#6])-[#6@H]1-[#6]-[#6]-[#6@H]2\[#6](-[#6]-[#6]-[#6][C@]12[#6])=[#6]\[#6]=[#6]-1/[#6]-[#6@@H](-[#8])-[#6](=[#6])-[#6@H](-[#8])-[#6]-1
: