Target
Kappa-type opioid receptor
Ligand
BDBM50417594
Substrate
Meas. Tech.
ChEMBL_699954 (CHEMBL1646361)
Ki
158±n/a nM
Citation
 Zhang, CWestaway, SMSpeake, JDBishop, MJGoetz, ASCarballo, LHHu, MEpperly, AH Tetrahydroquinoline derivatives as opioid receptor antagonists. Bioorg Med Chem Lett 21:670-6 (2011)  
Target
Name:
Kappa-type opioid receptor
Synonyms:
K-OR-1 Kappa-opioid receptor (KOR) Kappa-type opioid receptor (KOR) OPIATE Kappa OPRK1 kappa opioid receptor (KOR)
Type:
G Protein-Coupled Receptor (GPCR)
Mol. Mass.:
42648.76
Organism:
Homo sapiens (Human)
Description:
P41145
Residue:
380
  
Inhibitor
Name:
BDBM50417594
Synonyms:
CHEMBL1642753
Type:
Small organic molecule
Emp. Form.:
C27H29N3O
Mol. Mass.:
411.5387
SMILES:
Cc1cc(ccc1CNC1Cc2ccccc2C1)N1CCCc2cc(ccc12)C(N)=O
: