Target
Vasopressin V1b receptor
Ligand
BDBM50417715
Substrate
Meas. Tech.
ChEMBL_700574 (CHEMBL1648393)
Ki
630.96±n/a nM
Citation
 Smethurst, CABorthwick, JAGaines, SWatson, SGreen, ASchulz, MJBurton, GBuson, AAArban, R The characterization of a novel V1b antagonist lead series. Bioorg Med Chem Lett 21:92-6 (2010)  
Target
Name:
Vasopressin V1b receptor
Synonyms:
AVPR V1b AVPR1B Antidiuretic hormone receptor 1b V1bR VPR3 Vasopressin V1b receptor (V1b) Vasopressin V3 receptor
Type:
Enzyme
Mol. Mass.:
46985.01
Organism:
Homo sapiens (Human)
Description:
P47901
Residue:
424
  
Inhibitor
Name:
BDBM50417715
Synonyms:
CHEMBL1643611
Type:
Small organic molecule
Emp. Form.:
C26H33N3O4S2
Mol. Mass.:
515.688
SMILES:
CCCCNCc1ccc(cc1)-c1nc(CN([C@@H]2CCOC2)S(=O)(=O)c2ccc(OC)cc2)cs1
: