Target
Vasopressin V1a receptor
Ligand
BDBM50299342
Substrate
Meas. Tech.
ChEMBL_700575 (CHEMBL1648394)
Ki
5623.41±n/a nM
Citation
 Smethurst, CABorthwick, JAGaines, SWatson, SGreen, ASchulz, MJBurton, GBuson, AAArban, R The characterization of a novel V1b antagonist lead series. Bioorg Med Chem Lett 21:92-6 (2010)  
Target
Name:
Vasopressin V1a receptor
Synonyms:
AVPR V1a AVPR1A V1AR_HUMAN VASOPRESSIN V1A Vasopressin V1 receptor Vasopressin receptor
Type:
Receptor
Mol. Mass.:
46820.18
Organism:
Homo sapiens (Human)
Description:
P37288
Residue:
418
  
Inhibitor
Name:
BDBM50299342
Synonyms:
CHEMBL1204126 CHEMBL572709 | N-(cyclohexylmethyl)-1-(2-(1-(2,4-dimethoxyphenylsulfonyl)-1,2,3,4-tetrahydroquinolin-2-yl)ethylsulfonyl)piperidin-4-amine
Type:
Small organic molecule
Emp. Form.:
C31H45N3O6S2
Mol. Mass.:
619.836
SMILES:
COc1ccc(c(OC)c1)S(=O)(=O)N1C(CCS(=O)(=O)N2CCC(CC2)NCC2CCCCC2)CCc2ccccc12
: