Target
Prostaglandin D2 receptor
Ligand
BDBM50417776
Substrate
Meas. Tech.
ChEMBL_701282 (CHEMBL1648902)
IC50
5.13±n/a nM
Citation
 Mu, LAguiar, JArdati, ACao, BGardner, CJGillespy, THarris, KLim, SMarcus, RMorize, IParkar, AStefany, DLi, YVaz, RJCirovic, DA Understanding DP receptor antagonism using a CoMSIA approach. Bioorg Med Chem Lett 21:66-75 (2010)  
Target
Name:
Prostaglandin D2 receptor
Synonyms:
PD2R_HUMAN Prostaglandin D2 Prostanoid DP receptor
Type:
Enzyme
Mol. Mass.:
40288.87
Organism:
Homo sapiens (Human)
Description:
Q13258
Residue:
359
  
Inhibitor
Name:
BDBM50417776
Synonyms:
CHEMBL1644261
Type:
Small organic molecule
Emp. Form.:
C22H21N3O2S
Mol. Mass.:
391.486
SMILES:
COc1ccc(CCNc2cc(nc(OC)n2)-c2cc3ccccc3s2)cc1
: