Target
5-hydroxytryptamine receptor 6
Ligand
BDBM50340726
Substrate
Meas. Tech.
ChEMBL_716899 (CHEMBL1670878)
Ki
1.2±n/a nM
Citation
 Ivachtchenko, AVGolovina, ESKadieva, MGKysil, VMMitkin, ODTkachenko, SEOkun, I Synthesis and SAR of 3-arylsulfonyl-pyrazolo[1,5-a]pyrimidines as potent serotonin 5-HT6 receptor antagonists. Bioorg Med Chem 19:1482-91 (2011)  
Target
Name:
5-hydroxytryptamine receptor 6
Synonyms:
5-HT-6 5-hydroxytryptamine receptor 6 (5-HT-6) 5-hydroxytryptamine receptor 6 (5HT6) HTR6 Serotonin 6 (5-HT6) receptor | Serotonin Receptor 6
Type:
G Protein-Coupled Receptor (GPCR)
Mol. Mass.:
46968.43
Organism:
Homo sapiens (Human)
Description:
P50406
Residue:
440
  
Inhibitor
Name:
BDBM50340726
Synonyms:
5,7-dimethyl-2-(methylthio)-3-(phenylsulfonyl)pyrazolo[1,5-a]pyrimidine US8552005, 1.1(5)
Type:
Small organic molecule
Emp. Form.:
C15H15N3O2S2
Mol. Mass.:
333.429
SMILES:
CSc1nn2c(C)cc(C)nc2c1S(=O)(=O)c1ccccc1
: