Target
5-hydroxytryptamine receptor 6
Ligand
BDBM50417932
Substrate
Meas. Tech.
ChEMBL_716899 (CHEMBL1670878)
Ki
7.59±n/a nM
Citation
 Ivachtchenko, AVGolovina, ESKadieva, MGKysil, VMMitkin, ODTkachenko, SEOkun, I Synthesis and SAR of 3-arylsulfonyl-pyrazolo[1,5-a]pyrimidines as potent serotonin 5-HT6 receptor antagonists. Bioorg Med Chem 19:1482-91 (2011)  
Target
Name:
5-hydroxytryptamine receptor 6
Synonyms:
5-HT-6 5-hydroxytryptamine receptor 6 (5-HT-6) 5-hydroxytryptamine receptor 6 (5HT6) HTR6 Serotonin 6 (5-HT6) receptor | Serotonin Receptor 6
Type:
G Protein-Coupled Receptor (GPCR)
Mol. Mass.:
46968.43
Organism:
Homo sapiens (Human)
Description:
P50406
Residue:
440
  
Inhibitor
Name:
BDBM50417932
Synonyms:
CHEMBL1668587 | US8618114, 1.2.4(1)
Type:
Small organic molecule
Emp. Form.:
C16H18N4O3S
Mol. Mass.:
346.404
SMILES:
CNc1nn2c(COC)cc(C)nc2c1S(=O)(=O)c1ccccc1
: