Target
Potassium voltage-gated channel subfamily H member 2
Ligand
BDBM50028893
Substrate
Meas. Tech.
ChEMBL_725152 (CHEMBL1676103)
IC50
91201.08±n/a nM
Citation
 Sinha, NSen, S Predicting hERG activities of compounds from their 3D structures: development and evaluation of a global descriptors based QSAR model. Eur J Med Chem 46:618-30 (2011)  
Target
Name:
Potassium voltage-gated channel subfamily H member 2
Synonyms:
1,3-beta-glucan synthase component GLS2 ERG Eag-related protein 1 Ether-a-go-go-related gene (HERG) Ether-a-go-go-related gene potassium channel 1 Ether-a-go-go-related gene potassium channel 1 (hERG1) Ether-a-go-go-related protein 1 H-ERG KCNH2 Potassium voltage-gated channel subfamily H member 2 (hERG) Voltage-gated potassium channel subunit Kv11.1 hERG Potassium Channel 1 | putative potassium channel subunit
Type:
Multi-pass membrane protein
Mol. Mass.:
126672.65
Organism:
Homo sapiens (Human)
Description:
Q12809
Residue:
1159
  
Inhibitor
Name:
BDBM50028893
Synonyms:
4-(diisopropylamino)-2-phenyl-2-pyridin-2-ylbutanamide DISOPYRAMIDE gamma-Diisopropylamino-alpha-phenyl-alpha-(2-pyridyl)butyramide
Type:
Small organic molecule
Emp. Form.:
C21H29N3O
Mol. Mass.:
339.4745
SMILES:
CC(C)N(CCC(C(N)=O)(c1ccccc1)c1ccccn1)C(C)C
: