Target
Integrin alpha-4/beta-1
Ligand
BDBM50338189
Substrate
Meas. Tech.
ChEMBL_727812 (CHEMBL1686295)
IC50
10.0±n/a nM
Citation
 Semko, CMChen, LDressen, DBDreyer, MLDunn, WFarouz, FSFreedman, SBHolsztynska, EJJefferies, MKonradi, AWLiao, ALugar, JMutter, LPleiss, MAQuinn, KPThompson, TThorsett, EDVandevert, CXu, YZYednock, TA Discovery of a potent, orally bioavailable pyrimidine VLA-4 antagonist effective in a sheep asthma model. Bioorg Med Chem Lett 21:1741-3 (2011)  
Target
Name:
Integrin alpha-4/beta-1
Synonyms:
Fibronectin receptor beta/Integrin alpha-4 | Integrin alpha-4/beta-1
Type:
Mol. Mass.:
Description:
ASSAY_ID of EBI is 88912
Components:
This complex has 2 components.
Component 1
Name:
Integrin beta-1
Synonyms:
CD_antigen=CD29 Fibronectin receptor beta GPIIA ITGB1 MDF2 | MSK12
Type:
Enzyme
Mol. Mass.:
88400.38
Organism:
Homo sapiens (Human)
Description:
P05556
Residue:
798
  
Component 2
Name:
Integrin alpha-4
Synonyms:
CD49 antigen-like family member D CD49d antigen ITA4_HUMAN Integrin alpha-4 Integrin alpha-IV VLA-4 integrin alpha 4 precursor | integrin alpha-4 precursor
Type:
Membrane Protein
Mol. Mass.:
114897.35
Organism:
Homo sapiens (Human)
Description:
P13612
Residue:
1032
  
Inhibitor
Name:
BDBM50338189
Synonyms:
(2S)-2-(2-(cyclobutyl(methyl)amino)-5-ortho-tolylpyrimidin-4-ylamino)-3-(4-(dimethylcarbamoyloxy)phenyl)propanoic acid | CHEMBL1684976
Type:
Small organic molecule
Emp. Form.:
C28H33N5O4
Mol. Mass.:
503.5927
SMILES:
CN(C)C(=O)Oc1ccc(C[C@H](Nc2nc(ncc2-c2ccccc2C)N(C)C2CCC2)C(O)=O)cc1
: