Target
Cytochrome P450 2A6
Ligand
BDBM50331544
Substrate
Meas. Tech.
ChEMBL_738462 (CHEMBL1743539)
Ki
600±n/a nM
Citation
 Fontana, EDansette, PMPoli, SM Cytochrome p450 enzymes mechanism based inhibitors: common sub-structures and reactivity. Curr Drug Metab 6:413-54 (2005)  
Target
Name:
Cytochrome P450 2A6
Synonyms:
1,4-cineole 2-exo-monooxygenase CP2A6_HUMAN CYP2A6 Coumarin 7-hydroxylase Cytochrome P450 IIA3 | Cytochrome P450(I)
Type:
Protein
Mol. Mass.:
56514.34
Organism:
Homo sapiens (Human)
Description:
P11509
Residue:
494
  
Inhibitor
Name:
BDBM50331544
Synonyms:
7H-furo[3,2-g]chromen-7-one Furo[3,2-g]chromen-7-one | psoralen
Type:
Small organic molecule
Emp. Form.:
C11H6O3
Mol. Mass.:
186.1635
SMILES:
O=c1ccc2cc3ccoc3cc2o1
: