Target
Cytochrome P450 3A4
Ligand
BDBM50418090
Substrate
Meas. Tech.
ChEMBL_738359 (CHEMBL1743436)
Ki
20000±n/a nM
Citation
 Fontana, EDansette, PMPoli, SM Cytochrome p450 enzymes mechanism based inhibitors: common sub-structures and reactivity. Curr Drug Metab 6:413-54 (2005)  
Target
Name:
Cytochrome P450 3A4
Synonyms:
Albendazole monooxygenase CP3A4_HUMAN CYP3A4 CYPIIIA4 Cytochrome P450 3A4 (CYP3A4) Nifedipine oxidase Taurochenodeoxycholate 6-alpha-hydroxylase
Type:
Enzyme
Mol. Mass.:
57349.57
Organism:
Homo sapiens (Human)
Description:
Residue:
503
  
Inhibitor
Name:
BDBM50418090
Synonyms:
CHEMBL1743358
Type:
Small organic molecule
Emp. Form.:
C9H12O3
Mol. Mass.:
168.1898
SMILES:
CC(O)CCC(=O)c1ccoc1
: