Target
Cytochrome P450 3A4
Ligand
BDBM50310824
Substrate
Meas. Tech.
ChEMBL_738368 (CHEMBL1743445)
Ki
5560±n/a nM
Citation
 Fontana, EDansette, PMPoli, SM Cytochrome p450 enzymes mechanism based inhibitors: common sub-structures and reactivity. Curr Drug Metab 6:413-54 (2005)  
Target
Name:
Cytochrome P450 3A4
Synonyms:
Albendazole monooxygenase CP3A4_HUMAN CYP3A4 CYPIIIA4 Cytochrome P450 3A4 (CYP3A4) Nifedipine oxidase Taurochenodeoxycholate 6-alpha-hydroxylase
Type:
Enzyme
Mol. Mass.:
57349.57
Organism:
Homo sapiens (Human)
Description:
Residue:
503
  
Inhibitor
Name:
BDBM50310824
Synonyms:
6',7'-dihydroxybergamottin | CHEMBL1079119
Type:
Small organic molecule
Emp. Form.:
C21H24O6
Mol. Mass.:
372.4117
SMILES:
C\C(CC[C@@H](O)C(C)(C)O)=C/COc1c2ccoc2cc2oc(=O)ccc12
: