Target
Cytochrome P450 3A4
Ligand
BDBM50418096
Substrate
Meas. Tech.
ChEMBL_738379 (CHEMBL1743456)
Ki
250±n/a nM
Citation
 Fontana, EDansette, PMPoli, SM Cytochrome p450 enzymes mechanism based inhibitors: common sub-structures and reactivity. Curr Drug Metab 6:413-54 (2005)  
Target
Name:
Cytochrome P450 3A4
Synonyms:
Albendazole monooxygenase CP3A4_HUMAN CYP3A4 CYPIIIA4 Cytochrome P450 3A4 (CYP3A4) Nifedipine oxidase Taurochenodeoxycholate 6-alpha-hydroxylase
Type:
Enzyme
Mol. Mass.:
57349.57
Organism:
Homo sapiens (Human)
Description:
Residue:
503
  
Inhibitor
Name:
BDBM50418096
Synonyms:
CHEMBL1743364
Type:
Small organic molecule
Emp. Form.:
C30H34N2O5S
Mol. Mass.:
534.666
SMILES:
COc1ccc(OCCCN(C)CCOc2ccc3OCOc3c2)c(c1)C1Sc2ccccc2N1C(C)=C
: