Target
Cytochrome P450 2D6
Ligand
BDBM50418099
Substrate
Meas. Tech.
ChEMBL_738332 (CHEMBL1743407)
Ki
5500±n/a nM
Citation
 Fontana, EDansette, PMPoli, SM Cytochrome p450 enzymes mechanism based inhibitors: common sub-structures and reactivity. Curr Drug Metab 6:413-54 (2005)  
Target
Name:
Cytochrome P450 2D6
Synonyms:
CP2D6_HUMAN CYP2DL1 Cytochrome P450 2D6 (CYP2D6) P450-DB1
Type:
Protein
Mol. Mass.:
55774.82
Organism:
Homo sapiens (Human)
Description:
P10635
Residue:
497
  
Inhibitor
Name:
BDBM50418099
Synonyms:
CHEMBL1519342
Type:
Small organic molecule
Emp. Form.:
C17H22F3N5
Mol. Mass.:
353.3853
SMILES:
CCc1nc(C)c(CN2CCN(CC2)c2cc(ccn2)C(F)(F)F)[nH]1
: