Target
Cytochrome P450 3A4
Ligand
BDBM50121977
Substrate
Meas. Tech.
ChEMBL_738392 (CHEMBL1743469)
Ki
2110±n/a nM
Citation
 Fontana, EDansette, PMPoli, SM Cytochrome p450 enzymes mechanism based inhibitors: common sub-structures and reactivity. Curr Drug Metab 6:413-54 (2005)  
Target
Name:
Cytochrome P450 3A4
Synonyms:
Albendazole monooxygenase CP3A4_HUMAN CYP3A4 CYPIIIA4 Cytochrome P450 3A4 (CYP3A4) Nifedipine oxidase Taurochenodeoxycholate 6-alpha-hydroxylase
Type:
Enzyme
Mol. Mass.:
57349.57
Organism:
Homo sapiens (Human)
Description:
Residue:
503
  
Inhibitor
Name:
BDBM50121977
Synonyms:
2-(3,4-Dimethoxy-phenyl)-5-[2-(3,4-dimethoxy-phenyl)-ethylamino]-2-isopropyl-pentanenitrile Norverapamil (6%)
Type:
Small organic molecule
Emp. Form.:
C26H36N2O4
Mol. Mass.:
440.575
SMILES:
COc1ccc(CCNCCCC(C#N)(C(C)C)c2ccc(OC)c(OC)c2)cc1OC
: