Target
Cytochrome P450 2B4
Ligand
BDBM50310823
Substrate
Meas. Tech.
ChEMBL_738410 (CHEMBL1743487)
Ki
2800±n/a nM
Citation
 Fontana, EDansette, PMPoli, SM Cytochrome p450 enzymes mechanism based inhibitors: common sub-structures and reactivity. Curr Drug Metab 6:413-54 (2005)  
Target
Name:
Cytochrome P450 2B4
Synonyms:
CP2B4_RABIT CYPIIB4 Cytochrome P450 isozyme 2 Cytochrome P450 type B1
Type:
PROTEIN
Mol. Mass.:
55725.83
Organism:
Oryctolagus cuniculus
Description:
ChEMBL_774153
Residue:
491
  
Inhibitor
Name:
BDBM50310823
Synonyms:
CHEMBL1078442 | bergamottin
Type:
Small organic molecule
Emp. Form.:
C21H22O4
Mol. Mass.:
338.397
SMILES:
[#6]\[#6](-[#6])=[#6]\[#6]-[#6]\[#6](-[#6])=[#6]\[#6]-[#8]-c1c2ccoc2cc2oc(=O)ccc12
: