Target
Cytochrome P450 2B1
Ligand
BDBM50310823
Substrate
Meas. Tech.
ChEMBL_738412 (CHEMBL1743489)
Ki
2400±n/a nM
Citation
 Fontana, EDansette, PMPoli, SM Cytochrome p450 enzymes mechanism based inhibitors: common sub-structures and reactivity. Curr Drug Metab 6:413-54 (2005)  
Target
Name:
Cytochrome P450 2B1
Synonyms:
CP2B1_RAT Cyp2b1
Type:
PROTEIN
Mol. Mass.:
55940.51
Organism:
Rattus norvegicus
Description:
ChEMBL_774167
Residue:
491
  
Inhibitor
Name:
BDBM50310823
Synonyms:
CHEMBL1078442 | bergamottin
Type:
Small organic molecule
Emp. Form.:
C21H22O4
Mol. Mass.:
338.397
SMILES:
[#6]\[#6](-[#6])=[#6]\[#6]-[#6]\[#6](-[#6])=[#6]\[#6]-[#8]-c1c2ccoc2cc2oc(=O)ccc12
: