Target
Amine oxidase [flavin-containing] A
Ligand
BDBM50273490
Substrate
Meas. Tech.
ChEMBL_739780 (CHEMBL1763606)
Ki
69984199.6±n/a nM
Citation
 Shelke, SMBhosale, SHDash, RCSuryawanshi, MRMahadik, KR Exploration of new scaffolds as potential MAO-A inhibitors using pharmacophore and 3D-QSAR based in silico screening. Bioorg Med Chem Lett 21:2419-24 (2011)  
Target
Name:
Amine oxidase [flavin-containing] A
Synonyms:
AOFA_HUMAN MAO-A Monoamine oxidase Monoamine oxidase type A (MAO A) Monoamine oxidase type A (MAOA)
Type:
Protein
Mol. Mass.:
59689.53
Organism:
Homo sapiens (Human)
Description:
P21397
Residue:
527
  
Inhibitor
Name:
BDBM50273490
Synonyms:
CHEMBL456107 | N-Benzyl,N-methyl-1H-indole-2-carboxamide
Type:
Small organic molecule
Emp. Form.:
C17H16N2O
Mol. Mass.:
264.3217
SMILES:
CN(Cc1ccccc1)C(=O)c1cc2ccccc2[nH]1
: