Target
Transient receptor potential cation channel subfamily V member 1
Ligand
BDBM50418202
Substrate
Meas. Tech.
ChEMBL_741069 (CHEMBL1764297)
IC50
5.01±n/a nM
Citation
 Ratcliffe, PMaclean, JAbernethy, LClarkson, TDempster, MEasson, AMEdwards, DEverett, KFeilden, HLittlewood, PMcArthur, DMcGregor, DMcLuskey, HNimz, ONisbet, LAPalin, RTracey, HWalker, G Identification of potent, soluble, and orally active TRPV1 antagonists. Bioorg Med Chem Lett 21:2559-63 (2011)  
Target
Name:
Transient receptor potential cation channel subfamily V member 1
Synonyms:
Capsaicin receptor Osm-9-like TRP channel 1 TRPV1_HUMAN Transient receptor potential cation channel subfamily V member 1 (TRPV1) Transient receptor potential cation channel subfamily V member 1(TRPV1) Vanilloid VR1 Vanilloid receptor 1 Vanilloid receptor 1 (VRI/TRPV1)
Type:
Protein
Mol. Mass.:
94960.75
Organism:
Homo sapiens (Human)
Description:
Q8NER1
Residue:
839
  
Inhibitor
Name:
BDBM50418202
Synonyms:
CHEMBL1761706
Type:
Small organic molecule
Emp. Form.:
C24H30F3N3O4
Mol. Mass.:
481.5079
SMILES:
CN(C[C@@H]1CCCO1)Cc1c(noc1-c1ccc(cc1)C(F)(F)F)C(=O)N[C@@H]1CCC[C@H](O)C1
: