Target
Coagulation factor X
Ligand
BDBM12743
Substrate
Meas. Tech.
ChEMBL_743645 (CHEMBL1768188)
Ki
0.501±n/a nM
Citation
 Wawer, MBajorath, J Local structural changes, global data views: graphical substructure-activity relationship trailing. J Med Chem 54:2944-51 (2011)  
Target
Name:
Coagulation factor X
Synonyms:
Activated coagulation factor X (FXa) Coagulation factor X precursor F10 Factor X heavy chain Factor Xa Stuart-Prower factor
Type:
Enzyme
Mol. Mass.:
54726.60
Organism:
Homo sapiens (Human)
Description:
Residue:
488
  
Inhibitor
Name:
BDBM12743
Synonyms:
6-[4-(2-{[(3R)-3-hydroxypyrrolidin-1-yl]methyl}phenyl)phenyl]-1-(4-methoxyphenyl)-3-(trifluoromethyl)-1H,4H,5H,6H,7H-pyrazolo[3,4-c]pyridin-7-one dihydropyrazolopyridinone analogue 7c
Type:
Small organic molecule
Emp. Form.:
C31H29F3N4O3
Mol. Mass.:
562.5822
SMILES:
COc1ccc(cc1)-n1nc(c2CCN(C(=O)c12)c1ccc(cc1)-c1ccccc1CN1CC[C@@H](O)C1)C(F)(F)F
: