Target
Coagulation factor X
Ligand
BDBM19018
Substrate
Meas. Tech.
ChEMBL_743645 (CHEMBL1768188)
Ki
6.31±n/a nM
Citation
 Wawer, MBajorath, J Local structural changes, global data views: graphical substructure-activity relationship trailing. J Med Chem 54:2944-51 (2011)  
Target
Name:
Coagulation factor X
Synonyms:
Activated coagulation factor X (FXa) Coagulation factor X precursor F10 Factor X heavy chain Factor Xa Stuart-Prower factor
Type:
Enzyme
Mol. Mass.:
54726.60
Organism:
Homo sapiens (Human)
Description:
Residue:
488
  
Inhibitor
Name:
BDBM19018
Synonyms:
6-[4-(dimethylamino)phenyl]-1-(4-methoxyphenyl)-3-(trifluoromethyl)-1H,4H,5H,6H,7H-pyrazolo[3,4-c]pyridin-7-one | trifluoromethylpyrazole analogue, 36e
Type:
Small organic molecule
Emp. Form.:
C22H21F3N4O2
Mol. Mass.:
430.4229
SMILES:
COc1ccc(cc1)-n1nc(c2CCN(C(=O)c12)c1ccc(cc1)N(C)C)C(F)(F)F
: