Target
Cyclin-dependent kinase 5 activator 1
Ligand
BDBM50418696
Substrate
Meas. Tech.
ChEMBL_753141 (CHEMBL1799141)
IC50
340±n/a nM
Citation
 Shiradkar, MThomas, JKanase, VDighe, R Studying synergism of methyl linked cyclohexyl thiophenes with triazole: synthesis and their cdk5/p25 inhibition activity. Eur J Med Chem 46:2066-74 (2011)  
Target
Name:
Cyclin-dependent kinase 5 activator 1
Synonyms:
CDK5/p35 Cyclin-dependent kinase 5 regulatory subunit 1 | Cyclin-dependent kinase 5/CDK5 activator 1
Type:
Protein Complex
Mol. Mass.:
Description:
Components:
This complex has 2 components.
Component 1
Name:
Cyclin-dependent kinase 5
Synonyms:
CDK5 CDKN5 Cyclin-dependent kinase 5 (CDK5/ p25) Cyclin-dependent-like kinase 5 PSSALRE Tau protein kinase II catalytic subunit
Type:
Enzyme Subunit
Mol. Mass.:
33308.61
Organism:
Homo sapiens (Human)
Description:
Residue:
292
  
Component 2
Name:
Cyclin-dependent kinase 5 activator 1
Synonyms:
CD5R1_HUMAN CDK5R1 Cyclin-dependent kinase 5 (CDK5/p25) NCK5A p35
Type:
Enzyme Subunit
Mol. Mass.:
34077.43
Organism:
Homo sapiens (Human)
Description:
Q15078
Residue:
307
  
Inhibitor
Name:
BDBM50418696
Synonyms:
CHEMBL1796505
Type:
Small organic molecule
Emp. Form.:
C29H27Cl2N7O4S2
Mol. Mass.:
672.605
SMILES:
ClCC(=O)NNC(=O)CSc1nnc(Cc2c(NC(=O)c3ccccc3)sc3CCCCc23)n1NC(=O)c1ccc(Cl)cc1
: