Target
Cyclin-dependent kinase 5 activator 1
Ligand
BDBM50418708
Substrate
Meas. Tech.
ChEMBL_753141 (CHEMBL1799141)
IC50
362±n/a nM
Citation
 Shiradkar, MThomas, JKanase, VDighe, R Studying synergism of methyl linked cyclohexyl thiophenes with triazole: synthesis and their cdk5/p25 inhibition activity. Eur J Med Chem 46:2066-74 (2011)  
Target
Name:
Cyclin-dependent kinase 5 activator 1
Synonyms:
CDK5/p35 Cyclin-dependent kinase 5 regulatory subunit 1 | Cyclin-dependent kinase 5/CDK5 activator 1
Type:
Protein Complex
Mol. Mass.:
Description:
Components:
This complex has 2 components.
Component 1
Name:
Cyclin-dependent kinase 5
Synonyms:
CDK5 CDKN5 Cyclin-dependent kinase 5 (CDK5/ p25) Cyclin-dependent-like kinase 5 PSSALRE Tau protein kinase II catalytic subunit
Type:
Enzyme Subunit
Mol. Mass.:
33308.61
Organism:
Homo sapiens (Human)
Description:
Residue:
292
  
Component 2
Name:
Cyclin-dependent kinase 5 activator 1
Synonyms:
CD5R1_HUMAN CDK5R1 Cyclin-dependent kinase 5 (CDK5/p25) NCK5A p35
Type:
Enzyme Subunit
Mol. Mass.:
34077.43
Organism:
Homo sapiens (Human)
Description:
Q15078
Residue:
307
  
Inhibitor
Name:
BDBM50418708
Synonyms:
CHEMBL1796518
Type:
Small organic molecule
Emp. Form.:
C25H28ClN7O5S2
Mol. Mass.:
606.117
SMILES:
OC(=O)CCNc1sc2CCCCc2c1Cc1nnc(SCC(=O)NNC(=O)CCl)n1NC(=O)c1ccccc1
: