Target
Transient receptor potential cation channel subfamily V member 1
Ligand
BDBM50418970
Substrate
Meas. Tech.
ChEMBL_759395 (CHEMBL1810633)
IC50
158.49±n/a nM
Citation
 Ratcliffe, PAbernethy, LAnsari, NCameron, KClarkson, TDempster, MDunn, DEasson, AMEdwards, DEverett, KFeilden, HHo, KKKultgen, SLittlewood, PMaclean, JMcArthur, DMcGregor, DMcLuskey, HNeagu, INimz, ONisbet, LAOhlmeyer, MPalin, RPham, QRong, YRoughton, ASammons, MSwanson, RTracey, HWalker, G Discovery of potent, soluble and orally active TRPV1 antagonists. Structure-activity relationships of a series of isoxazoles. Bioorg Med Chem Lett 21:4652-7 (2011)  
Target
Name:
Transient receptor potential cation channel subfamily V member 1
Synonyms:
Capsaicin receptor Osm-9-like TRP channel 1 TRPV1_HUMAN Transient receptor potential cation channel subfamily V member 1 (TRPV1) Transient receptor potential cation channel subfamily V member 1(TRPV1) Vanilloid VR1 Vanilloid receptor 1 Vanilloid receptor 1 (VRI/TRPV1)
Type:
Protein
Mol. Mass.:
94960.75
Organism:
Homo sapiens (Human)
Description:
Q8NER1
Residue:
839
  
Inhibitor
Name:
BDBM50418970
Synonyms:
CHEMBL1807955
Type:
Small organic molecule
Emp. Form.:
C17H17F3N2O3
Mol. Mass.:
354.3237
SMILES:
OCc1c(noc1-c1ccc(cc1)C(F)(F)F)C(=O)NC1CCCC1
: