Target
Integrin alpha-V/beta-3
Ligand
BDBM50419042
Substrate
Meas. Tech.
ChEMBL_766058 (CHEMBL1828410)
IC50
193±n/a nM
Citation
 Selvaraj, RLiu, SHassink, MHuang, CWYap, LPPark, RFox, JMLi, ZConti, PS Tetrazine-trans-cyclooctene ligation for the rapid construction of integrinavß3 targeted PET tracer based on a cyclic RGD peptide. Bioorg Med Chem Lett 21:5011-4 (2011)  
Target
Name:
Integrin alpha-V/beta-3
Synonyms:
ITGAV/ITGB3 | Integrin beta-3/Vitronectin receptor alpha
Type:
Enzyme
Mol. Mass.:
Description:
Components:
This complex has 2 components.
Component 1
Name:
Integrin alpha-V
Synonyms:
ITAV_HUMAN Integrin alpha-V/alpha-5 VNRA Vitronectin receptor | Vitronectin receptor subunit alpha
Type:
PROTEIN
Mol. Mass.:
116024.92
Organism:
Homo sapiens (Human)
Description:
ChEMBL_582336
Residue:
1048
  
Component 2
Name:
Integrin beta-3
Synonyms:
CD_antigen=CD61 GPIIIa ITGB3 Platelet membrane glycoprotein IIIa
Type:
Protein
Mol. Mass.:
87038.91
Organism:
Homo sapiens (Human)
Description:
P05106
Residue:
788
  
Inhibitor
Name:
BDBM50419042
Synonyms:
CHEMBL1824706
Type:
Small organic molecule
Emp. Form.:
C54H71FN14O11
Mol. Mass.:
1111.2271
SMILES:
[#7]\[#6](-[#7])=[#7]\[#6]-[#6]-[#6]-[#6@H]-1-[#7]-[#6](=O)-[#6]-[#7]-[#6](=O)-[#6@@H](-[#6]-[#6](-[#8])=O)-[#7]-[#6](=O)-[#6@H](-[#6]-c2ccc(-[#8])cc2)-[#7]-[#6](=O)-[#6@@H](-[#6]-[#6]-[#6]-[#6]-[#7]-[#6](=O)-[#6]-[#6]-[#6]-[#6](=O)-[#7]-c2ccc(nc2)-[#6]-2=[#7]-[#7]=[#6](-[#6@@H]-3-[#6]-[#6]-[#6]-[#6@H](-[#6]-[#6]-[#6@@H]-2-3)-[#8]-[#6]-[#6]F)-c2ccccn2)-[#7]-[#6]-1=O
: