Target
Potassium/sodium hyperpolarization-activated cyclic nucleotide-gated channel 1
Ligand
BDBM50419072
Substrate
Meas. Tech.
ChEMBL_767270 (CHEMBL1825382)
IC50
>199526.23±n/a nM
Citation
 McClure, KJMaher, MWu, NChaplan, SREckert, WALee, DHWickenden, ADHermann, MAllison, BHawryluk, NBreitenbucher, JGGrice, CA Discovery of a novel series of selective HCN1 blockers. Bioorg Med Chem Lett 21:5197-201 (2011)  
Target
Name:
Potassium/sodium hyperpolarization-activated cyclic nucleotide-gated channel 1
Synonyms:
BCNG-1 Brain cyclic nucleotide-gated channel 1 HCN1_HUMAN
Type:
PROTEIN
Mol. Mass.:
98811.53
Organism:
Homo sapiens (Human)
Description:
ChEMBL_767270
Residue:
890
  
Inhibitor
Name:
BDBM50419072
Synonyms:
CHEMBL1332972
Type:
Small organic molecule
Emp. Form.:
C19H28N2O3
Mol. Mass.:
332.4372
SMILES:
COc1ccccc1C(=O)NCC1(CCCCC1)N1CCOCC1
: