Target
Potassium/sodium hyperpolarization-activated cyclic nucleotide-gated channel 4
Ligand
BDBM50419067
Substrate
Meas. Tech.
ChEMBL_767271 (CHEMBL1825383)
IC50
158.49±n/a nM
Citation
 McClure, KJMaher, MWu, NChaplan, SREckert, WALee, DHWickenden, ADHermann, MAllison, BHawryluk, NBreitenbucher, JGGrice, CA Discovery of a novel series of selective HCN1 blockers. Bioorg Med Chem Lett 21:5197-201 (2011)  
Target
Name:
Potassium/sodium hyperpolarization-activated cyclic nucleotide-gated channel 4
Synonyms:
HCN4 | HCN4_HUMAN
Type:
PROTEIN
Mol. Mass.:
129069.19
Organism:
Homo sapiens (Human)
Description:
ChEMBL_1454251
Residue:
1203
  
Inhibitor
Name:
BDBM50419067
Synonyms:
CHEMBL1823878
Type:
Small organic molecule
Emp. Form.:
C22H35N3O2
Mol. Mass.:
373.5322
SMILES:
CCOc1ccccc1C(=O)NCC1(CCCCC1)N1CCN(CC)CC1
: