Target
Potassium/sodium hyperpolarization-activated cyclic nucleotide-gated channel 4
Ligand
BDBM50419086
Substrate
Meas. Tech.
ChEMBL_767271 (CHEMBL1825383)
IC50
158489.32±n/a nM
Citation
 McClure, KJMaher, MWu, NChaplan, SREckert, WALee, DHWickenden, ADHermann, MAllison, BHawryluk, NBreitenbucher, JGGrice, CA Discovery of a novel series of selective HCN1 blockers. Bioorg Med Chem Lett 21:5197-201 (2011)  
Target
Name:
Potassium/sodium hyperpolarization-activated cyclic nucleotide-gated channel 4
Synonyms:
HCN4 | HCN4_HUMAN
Type:
PROTEIN
Mol. Mass.:
129069.19
Organism:
Homo sapiens (Human)
Description:
ChEMBL_1454251
Residue:
1203
  
Inhibitor
Name:
BDBM50419086
Synonyms:
CHEMBL1823671
Type:
Small organic molecule
Emp. Form.:
C22H26ClN3O
Mol. Mass.:
383.914
SMILES:
CN1CCN(CC1)C1(CNC(=O)c2ccccc2Cl)Cc2ccccc2C1
: