Target
Potassium/sodium hyperpolarization-activated cyclic nucleotide-gated channel 4
Ligand
BDBM50419062
Substrate
Meas. Tech.
ChEMBL_767271 (CHEMBL1825383)
IC50
5011.87±n/a nM
Citation
 McClure, KJMaher, MWu, NChaplan, SREckert, WALee, DHWickenden, ADHermann, MAllison, BHawryluk, NBreitenbucher, JGGrice, CA Discovery of a novel series of selective HCN1 blockers. Bioorg Med Chem Lett 21:5197-201 (2011)  
Target
Name:
Potassium/sodium hyperpolarization-activated cyclic nucleotide-gated channel 4
Synonyms:
HCN4 | HCN4_HUMAN
Type:
PROTEIN
Mol. Mass.:
129069.19
Organism:
Homo sapiens (Human)
Description:
ChEMBL_1454251
Residue:
1203
  
Inhibitor
Name:
BDBM50419062
Synonyms:
CHEMBL1435630
Type:
Small organic molecule
Emp. Form.:
C20H31N3O2
Mol. Mass.:
345.479
SMILES:
COc1ccccc1C(=O)NCC1(CCCCC1)N1CCN(C)CC1
: