Target
Orexin/Hypocretin receptor type 1
Ligand
BDBM50417257
Substrate
Meas. Tech.
ChEMBL_768079 (CHEMBL1833035)
Ki
0.759±n/a nM
Citation
 Di Fabio, RPellacani, AFaedo, SRoth, APiccoli, LGerrard, PPorter, RAJohnson, CNThewlis, KDonati, DStasi, LSpada, SStemp, GNash, DBranch, CKindon, LMassagrande, MPoffe, ABraggio, SChiarparin, EMarchioro, CRatti, ECorsi, M Discovery process and pharmacological characterization of a novel dual orexin 1 and orexin 2 receptor antagonist useful for treatment of sleep disorders. Bioorg Med Chem Lett 21:5562-7 (2011)  
Target
Name:
Orexin/Hypocretin receptor type 1
Synonyms:
HCRTR1 OX1R_HUMAN Orexin receptor type 1 (OR 1) Orexin receptor type 1 (OX1) Orexin receptor type 1 (OxR1) | Ox1r
Type:
Protein
Mol. Mass.:
47554.50
Organism:
Homo sapiens (Human)
Description:
O43613
Residue:
425
  
Inhibitor
Name:
BDBM50417257
Synonyms:
SB-649868
Type:
Small organic molecule
Emp. Form.:
C26H24FN3O3S
Mol. Mass.:
477.55
SMILES:
Cc1nc(C(=O)N2CCCC[C@H]2CNC(=O)c2cccc3occc23)c(s1)-c1ccc(F)cc1
: