Target
Aurora kinase B
Ligand
BDBM50419260
Substrate
Meas. Tech.
ChEMBL_772964 (CHEMBL1838852)
IC50
398±n/a nM
Citation
 Liddle, JAtkinson, FLBarker, MDCarter, PSCurtis, NRDavis, RPDouault, CDickson, MCElwes, DGarton, NSGray, MHayhow, TGHobbs, CIJones, ELeach, SLeavens, KLewis, HDMcCleary, SNeu, MPatel, VKPreston, AGRamirez-Molina, CShipley, TJSkone, PASmithers, NSomers, DOWalker, ALWatson, RJWeingarten, GG Discovery of GSK143, a highly potent, selective and orally efficacious spleen tyrosine kinase inhibitor. Bioorg Med Chem Lett 21:6188-94 (2011)  
Target
Name:
Aurora kinase B
Synonyms:
AIK2 AIM1 ARK2 AURKB_HUMAN Aurora B-INCENP Aurora kinase B (AURKB) STK-1 STK12 Serine/threonine-protein kinase aurora B
Type:
Protein
Mol. Mass.:
39327.72
Organism:
Homo sapiens (Human)
Description:
Q96GD4
Residue:
344
  
Inhibitor
Name:
BDBM50419260
Synonyms:
CHEMBL1834758
Type:
Small organic molecule
Emp. Form.:
C17H22N6O
Mol. Mass.:
326.3962
SMILES:
Cc1cccc(Nc2nc(N[C@H]3CCCNC3)ncc2C(N)=O)c1
: