Target
Mitogen-activated protein kinase 1/3
Ligand
BDBM50419262
Substrate
Meas. Tech.
ChEMBL_772881 (CHEMBL1838284)
IC50
316±n/a nM
Citation
 Liddle, JAtkinson, FLBarker, MDCarter, PSCurtis, NRDavis, RPDouault, CDickson, MCElwes, DGarton, NSGray, MHayhow, TGHobbs, CIJones, ELeach, SLeavens, KLewis, HDMcCleary, SNeu, MPatel, VKPreston, AGRamirez-Molina, CShipley, TJSkone, PASmithers, NSomers, DOWalker, ALWatson, RJWeingarten, GG Discovery of GSK143, a highly potent, selective and orally efficacious spleen tyrosine kinase inhibitor. Bioorg Med Chem Lett 21:6188-94 (2011)  
Target
Name:
Mitogen-activated protein kinase 1/3
Synonyms:
Mitogen-activated protein kinase; ERK1/ERK2 t-ERK1/2
Type:
Mol. Mass.:
Description:
ASSAY_ID of ChEMBL is 124147
Components:
This complex has 2 components.
Component 1
Name:
Mitogen-activated protein kinase 1
Synonyms:
ERK2 Extracellular signal-regulated kinase 2 Extracellular signal-regulated kinase 2 (ERK2) MAPK 2 MK01_HUMAN Mitogen-activated protein kinase 1 (ERK-2) Mitogen-activated protein kinase 2 PRKM2 | p42-MAPK
Type:
Ser/Thr Protein Kinase
Mol. Mass.:
41392.76
Organism:
Homo sapiens (Human)
Description:
P28482
Residue:
360
  
Component 2
Name:
Mitogen-activated protein kinase 3
Synonyms:
ERK1 Extracellular signal-regulated kinase 1 MAP kinase ERK1 MAPK3/MAPK7 Mitogen-activated protein kinase PRKM3
Type:
Protein
Mol. Mass.:
43136.58
Organism:
Homo sapiens (Human)
Description:
curated by PDB 4QTB
Residue:
379
  
Inhibitor
Name:
BDBM50419262
Synonyms:
CHEMBL1835068
Type:
Small organic molecule
Emp. Form.:
C18H22F2N6O
Mol. Mass.:
376.4037
SMILES:
Cc1cccc(Nc2nc(N[C@@H]3CCC(F)(F)C[C@@H]3N)ncc2C(N)=O)c1
: